Reaction Details
TargetSubstance-P receptor
LigandBDBM50000040
Substrate/Competitorn/a
Meas. Tech.ChEBML_142878
IC50 10±n/a nM
Citation Ofner, SHauser, KSchilling, WVassout, AVeenstra, SJ SAR of 2-benzyl-4-aminopiperidines: CGP 49823, an orally and centrally active non-peptide NK1 antagonist Bioorg Med Chem Lett6:1623-1628 (1996)    Article
 
Substance-P receptor
Name:Substance-P receptor
Type:G Protein-Coupled Receptor (GPCR)
Mol. Mass.:46254.43
Organism:Homo sapiens (Human)
Description:P25103
Residue:407
BDBM50000040
NameBDBM50000040
Synonyms:((2S,3S)-2-Benzhydryl-1-aza-bicyclo[2.2.2]oct-3-yl)-(2-methoxy-benzyl)-amine (+)(2-Benzhydryl-1-aza-bicyclo[2.2.2]oct-3-yl)-(2-methoxy-benzyl)-amine (2-Benzhydryl-1-aza-bicyclo[2.2.2]oct-3-yl)-(2-methoxy-benzyl)-amine CP-96,345 i(2-Benzhydryl-1-aza-bicyclo[2.2.2]oct-3-yl)-(2-methoxy-benzyl)-amine
TypeSmall organic molecule
Emp. Form.C28H32N2O
Mol. Mass.412.5665
SMILESCOc1ccccc1CN[C@H]1C2CCN(CC2)[C@H]1C(c1ccccc1)c1ccccc1