Reaction Details
TargetInterstitial collagenase
LigandBDBM50287494
Substrate/Competitorn/a
Meas. Tech.ChEBML_101739
IC50 570±n/a nM
Citation Robinson, RPRagan, JACronin, BJDonahue, KMLopresti-Morrow, LLMitchell, PGReeves, LMYocum, SA Inhibitors of MMP-1: an examination of P1′ Cα gem-disubstitution in the succinamide hydroxamate series Bioorg Med Chem Lett6:1719-1724 (1996)    Article
 
Interstitial collagenase
Name:Interstitial collagenase
Type:Enzyme
Mol. Mass.:54010.26
Organism:Homo sapiens (Human)
Description: P03956
Residue:469
BDBM50287494
NameBDBM50287494
Synonyms:2-Hydroxycarbamoylmethyl-indan-2-carboxylic acid [(S)-2-(4-methoxy-phenyl)-1-methylcarbamoyl-ethyl]-amide | CHEMBL433479
TypeSmall organic molecule
Emp. Form.C23H27N3O5
Mol. Mass.425.4776
SMILESCNC(=O)[C@H](Cc1ccc(OC)cc1)NC(=O)C1(CC(=O)NO)Cc2ccccc2C1