Reaction Details
TargetProtein kinase C eta type
LigandBDBM3199
Substrate/Competitorn/a
Meas. Tech.ChEMBL_153152 (CHEMBL761875)
IC50 3.00±n/a nM
Citation Jr., GEDefauw, JMLampe, JWDarges, JWKalter, K Potent and selective PKC inhibitory 5-membered ring analogs of balanol with replacement of the carboxamide moiety Bioorg Med Chem Lett6:1759-1764 (1996)    Article
 
Protein kinase C eta type
Name:Protein kinase C eta type
Type:Enzyme
Mol. Mass.:77844.26
Organism:Homo sapiens (Human)
Description:The recombinant human PKC enzymes were produced using a baculovirus expression system in SF9 cells
Residue:683
BDBM3199
NameBDBM3199
Synonyms:(+-)-anti-2-[[2,6-Dihydroxy-4-[[[2-(4-hydroxybenzyl)cyclopentyl]oxy]carbonyl]phenyl]carbonyl]-3-hydroxybenzoic acid Acyclic Balanol Analog 29b
TypeSmall organic molecule
Emp. Form.C27H24O9
Mol. Mass.492.4741
SMILESOC(=O)c1cccc(O)c1C(=O)c1c(O)cc(cc1O)C(=O)O[C@@H]1CCC[C@H]1Cc1ccc(O)cc1