Reaction Details
TargetProtein kinase C alpha type
LigandBDBM3153
Substrate/Competitorn/a
Meas. Tech.ChEBML_153130
IC50 40±n/a nM
Citation Jr., GEDefauw, JMLampe, JWDarges, JWKalter, K Potent and selective PKC inhibitory 5-membered ring analogs of balanol with replacement of the carboxamide moiety Bioorg Med Chem Lett6:1759-1764 (1996)    Article
 
Protein kinase C alpha type
Name:Protein kinase C alpha type
Type:Enzyme
Mol. Mass.:76755.65
Organism:Homo sapiens (Human)
Description:The recombinant human PKC enzymes were produced using a baculovirus expression system in SF9 cells
Residue:672
BDBM3153
NameBDBM3153
Synonyms:2-{[2,6-dihydroxy-4-({[(1R,2R)-2-[(4-hydroxybenzene)amido]cyclopentyl]oxy}carbonyl)phenyl]carbonyl}-3-hydroxybenzoic acid CHEMBL52529
TypeSmall organic molecule
Emp. Form.C27H23NO10
Mol. Mass.521.4722
SMILESOC(=O)c1cccc(O)c1C(=O)c1c(O)cc(cc1O)C(=O)O[C@@H]1CCC[C@H]1NC(=O)c1ccc(O)cc1