Reaction Details
TargetTissue alpha-L-fucosidase
LigandBDBM50104398
Substrate/Competitorn/a
Meas. Tech.ChEBML_33958
Ki 3300±n/a nM
Citation Tsuruta, OYuasa, HHashimoto, H p-Nitrophenyl 1,5-dithio-alpha-L-fucopyranoside: a novel sulfur based fucosidase inhibitor Bioorg Med Chem Lett6:1989-1992 (1996)    Article
 
Tissue alpha-L-fucosidase
Name:Tissue alpha-L-fucosidase
Type:PROTEIN
Mol. Mass.:53690.69
Organism:Homo sapiens (Human)
Description:ChEMBL_34088
Residue:466
BDBM50104398
NameBDBM50104398
Synonyms:(R)-2-Methyl-6-(4-nitro-phenylsulfanyl)-tetrahydro-thiopyran-3,4,5-triol | CHEMBL314581
TypeSmall organic molecule
Emp. Form.C12H15NO5S2
Mol. Mass.317.381
SMILESCC1SC(Sc2ccc(cc2)[N+]([O-])=O)C(O)[C@H](O)C1O