Reaction Details
TargetTissue alpha-L-fucosidase
LigandBDBM50287681
Substrate/Competitorn/a
Meas. Tech.ChEBML_33958
Ki 406000±n/a nM
Citation Tsuruta, OYuasa, HHashimoto, H p-Nitrophenyl 1,5-dithio-alpha-L-fucopyranoside: a novel sulfur based fucosidase inhibitor Bioorg Med Chem Lett6:1989-1992 (1996)    Article
 
Tissue alpha-L-fucosidase
Name:Tissue alpha-L-fucosidase
Type:PROTEIN
Mol. Mass.:53690.69
Organism:Homo sapiens (Human)
Description:ChEMBL_34088
Residue:466
BDBM50287681
NameBDBM50287681
Synonyms:CHEMBL59958 | Sodium; Phosphoric acid mono-((3S,4S,5R)-3,4,5-trihydroxy-6-methyl-tetrahydro-thiopyran-2-yl) ester
TypeSmall organic molecule
Emp. Form.C6H11O7PS
Mol. Mass.258.187
SMILESCC1SC(OP([O-])([O-])=O)C(O)C(O)C1O