Reaction Details
TargetTissue alpha-L-fucosidase
LigandBDBM50287683
Substrate/Competitorn/a
Meas. Tech.ChEBML_33958
Ki 690000±n/a nM
Citation Tsuruta, OYuasa, HHashimoto, H p-Nitrophenyl 1,5-dithio-alpha-L-fucopyranoside: a novel sulfur based fucosidase inhibitor Bioorg Med Chem Lett6:1989-1992 (1996)    Article
 
Tissue alpha-L-fucosidase
Name:Tissue alpha-L-fucosidase
Type:PROTEIN
Mol. Mass.:53690.69
Organism:Homo sapiens (Human)
Description:ChEMBL_34088
Residue:466
BDBM50287683
NameBDBM50287683
Synonyms:(3S,4S,5R)-2-Methoxy-6-methyl-tetrahydro-thiopyran-3,4,5-triol | CHEMBL301043
TypeSmall organic molecule
Emp. Form.C7H14O4S
Mol. Mass.194.249
SMILESCOC1SC(C)C(O)C(O)C1O