Reaction Details
TargetNeprilysin
LigandBDBM50287693
Substrate/Competitorn/a
Meas. Tech.ChEBML_144623
Ki 7±n/a nM
Citation Beight, DWMehdi, SKoehl, JRFlynn, GA Synthesis of constrained thiorphan analogs as inhibitors of neutral endopeptidase Bioorg Med Chem Lett6:2053-2058 (1996)    Article
 
Neprilysin
Name:Neprilysin
Type:Protein
Mol. Mass.:85789.59
Organism:Rattus norvegicus (Rat)
Description:P07861
Residue:750
BDBM50287693
NameBDBM50287693
Synonyms:(S)-2-[(2-Mercaptomethyl-1,2,3,4-tetrahydro-naphthalene-2-carbonyl)-amino]-4-methyl-pentanoic acid methyl ester | CHEMBL64661
TypeSmall organic molecule
Emp. Form.C19H27NO3S
Mol. Mass.349.488
SMILESCOC(=O)[C@H](CC(C)C)NC(=O)C1(CS)CCc2ccccc2C1