Reaction Details
TargetNeprilysin
LigandBDBM50024102
Substrate/Competitorn/a
Meas. Tech.ChEBML_144623
Ki 1.9±n/a nM
Citation Beight, DWMehdi, SKoehl, JRFlynn, GA Synthesis of constrained thiorphan analogs as inhibitors of neutral endopeptidase Bioorg Med Chem Lett6:2053-2058 (1996)    Article
 
Neprilysin
Name:Neprilysin
Type:Protein
Mol. Mass.:85789.59
Organism:Rattus norvegicus (Rat)
Description:P07861
Residue:750
BDBM50024102
NameBDBM50024102
Synonyms:((S)-2-Mercaptomethyl-3-phenyl-propionylamino)-acetic acid (S) (2-Mercaptomethyl-3-phenyl-propionylamino)-acetic acid CHEMBL298827
TypeSmall organic molecule
Emp. Form.C12H15NO3S
Mol. Mass.253.317
SMILESOC(=O)CNC(=O)[C@@H](CS)Cc1ccccc1