Reaction Details
TargetNeprilysin
LigandBDBM50287697
Substrate/Competitorn/a
Meas. Tech.ChEBML_144623
Ki>300±n/a nM
Citation Beight, DWMehdi, SKoehl, JRFlynn, GA Synthesis of constrained thiorphan analogs as inhibitors of neutral endopeptidase Bioorg Med Chem Lett6:2053-2058 (1996)    Article
 
Neprilysin
Name:Neprilysin
Type:Protein
Mol. Mass.:85789.59
Organism:Rattus norvegicus (Rat)
Description:P07861
Residue:750
BDBM50287697
NameBDBM50287697
Synonyms:(4S,7S)-7-Mercaptomethyl-6-oxo-1,2,3,4,6,7,8,12b-octahydro-benzo[c]pyrido[1,2-a]azepine-4-carboxylic acid MDL-28102
TypeSmall organic molecule
Emp. Form.C16H19NO3S
Mol. Mass.305.392
SMILESOC(=O)[C@@H]1CCCC2N1C(=O)[C@@H](CS)Cc1ccccc21