Reaction Details
TargetNeprilysin
LigandBDBM50287701
Substrate/Competitorn/a
Meas. Tech.ChEBML_144623
Ki 5±n/a nM
Citation Beight, DWMehdi, SKoehl, JRFlynn, GA Synthesis of constrained thiorphan analogs as inhibitors of neutral endopeptidase Bioorg Med Chem Lett6:2053-2058 (1996)    Article
 
Neprilysin
Name:Neprilysin
Type:Protein
Mol. Mass.:85789.59
Organism:Rattus norvegicus (Rat)
Description:P07861
Residue:750
BDBM50287701
NameBDBM50287701
Synonyms:(4S,7S)-7-(2-Mercapto-acetylamino)-6-oxo-1,2,3,4,6,7,8,12b-octahydro-benzo[c]pyrido[1,2-a]azepine-4-carboxylic acid MDL-27855
TypeSmall organic molecule
Emp. Form.C17H20N2O4S
Mol. Mass.348.417
SMILESOC(=O)[C@@H]1CCCC2N1C(=O)[C@H](Cc1ccccc21)NC(=O)CS