Reaction Details
TargetAlpha-1A adrenergic receptor
LigandBDBM50287720
Substrate/Competitorn/a
Meas. Tech.ChEBML_32893
Ki 138±n/a nM
Citation Phife, DWRamos, RAFeng, MKing, IGunasekera, SPWright, APatel, MPachter, JACoval, SJ Marine sponge bis(indole) alkaloids that displace ligand binding to α1 adrenergic receptors Bioorg Med Chem Lett6:2103-2106 (1996)    Article
 
Alpha-1A adrenergic receptor
Name:Alpha-1A adrenergic receptor
Type:Protein
Mol. Mass.:51620.15
Organism:Rattus norvegicus (Rat)
Description:P43140
Residue:466
BDBM50287720
NameBDBM50287720
Synonyms:6,7-Dibromo-3-[(2S,5R)-5-(6-bromo-1H-indol-3-yl)-4-methyl-piperazin-2-yl]-1H-indol-4-ol | CHEMBL302882
TypeSmall organic molecule
Emp. Form.C21H19Br3N4O
Mol. Mass.583.114
SMILESCN1C[C@@H](NC[C@H]1c1c[nH]c2cc(Br)ccc12)c1c[nH]c2c(Br)c(Br)cc(O)c12