Reaction Details
TargetPeroxisome proliferator-activated receptor gamma
LigandBDBM50049244
Substrate/Competitorn/a
Meas. Tech.ChEBML_153639
Ki 22±n/a nM
Citation Buckle, DRCantello, BCCawthorne, MACoyle, PJDean, DKFaller, AHaigh, DHindley, RMJefcott, LJLister, CAPinto, ILRami, HKSmith, DGSmith, SA Non thiazolidinedione antihyperglycaemic agents. 1: α-Heteroatom substituted β-phenylpropanoic acids Bioorg Med Chem Lett6:2121-2126 (1996)    Article
 
Peroxisome proliferator-activated receptor gamma
Name:Peroxisome proliferator-activated receptor gamma
Type:Nuclear Receptor
Mol. Mass.:57613.46
Organism:Homo sapiens (Human)
Description:P37231
Residue:505
BDBM50049244
NameBDBM50049244
Synonyms:5-{4-[2-(Benzooxazol-2-yl-methyl-amino)-ethoxy]-benzyl}-thiazolidine-2,4-dione CHEMBL17805
TypeSmall organic molecule
Emp. Form.C20H19N3O4S
Mol. Mass.397.448
SMILESCN(CCOc1ccc(Cc2sc(=O)[nH]c2O)cc1)c1nc2ccccc2o1