Reaction Details
TargetPeroxisome proliferator-activated receptor gamma
LigandBDBM50287733
Substrate/Competitorn/a
Meas. Tech.ChEMBL_153640 (CHEMBL762705)
Ki 30±n/a nM
Citation Buckle, DRCantello, BCCawthorne, MACoyle, PJDean, DKFaller, AHaigh, DHindley, RMJefcott, LJLister, CAPinto, ILRami, HKSmith, DGSmith, SA Non thiazolidinedione antihyperglycaemic agents. 2: α-Carbon substituted β-phenylpropanoic acids1 Bioorg Med Chem Lett6:2127-2130 (1996)    Article
 
Peroxisome proliferator-activated receptor gamma
Name:Peroxisome proliferator-activated receptor gamma
Type:Nuclear Receptor
Mol. Mass.:57613.46
Organism:Homo sapiens (Human)
Description:P37231
Residue:505
BDBM50287733
NameBDBM50287733
Synonyms:2-{4-[2-(Benzooxazol-2-yl-methyl-amino)-ethoxy]-benzyl}-5-phenyl-pentanoic acid | CHEMBL304046
TypeSmall organic molecule
Emp. Form.C28H30N2O4
Mol. Mass.458.5488
SMILESCN(CCOc1ccc(CC(CCCc2ccccc2)C(O)=O)cc1)c1nc2ccccc2o1