Reaction Details
TargetBeta-1 adrenergic receptor
LigandBDBM50287800
Substrate/Competitorn/a
Meas. Tech.ChEBML_37404
Ki 440±n/a nM
Citation Fisher, LGSher, PMSkwish, SMichel, IMSeiler, SMDickinson, KE BMS-187257, a potent, selective, and novel heterocyclic β3 adrenergic receptor agonist Bioorg Med Chem Lett6:2253-2258 (1996)    Article
 
Beta-1 adrenergic receptor
Name:Beta-1 adrenergic receptor
Type:G Protein-Coupled Receptor (GPCR)
Mol. Mass.:51338.40
Organism:Homo sapiens (Human)
Description:P08588
Residue:477
BDBM50287800
NameBDBM50287800
Synonyms:5-{2-[(R)-2-((S)-2-Hydroxy-3-phenoxy-propylamino)-propyl]-thiazol-5-yl}-pentanoic acid | CHEMBL419085
TypeSmall organic molecule
Emp. Form.C20H28N2O4S
Mol. Mass.392.512
SMILESC[C@H](Cc1ncc(CCCCC(O)=O)s1)NC[C@H](O)COc1ccccc1