Reaction Details
TargetBeta-1 adrenergic receptor
LigandBDBM50287799
Substrate/Competitorn/a
Meas. Tech.ChEBML_37404
Ki 1300±n/a nM
Citation Fisher, LGSher, PMSkwish, SMichel, IMSeiler, SMDickinson, KE BMS-187257, a potent, selective, and novel heterocyclic β3 adrenergic receptor agonist Bioorg Med Chem Lett6:2253-2258 (1996)    Article
 
Beta-1 adrenergic receptor
Name:Beta-1 adrenergic receptor
Type:G Protein-Coupled Receptor (GPCR)
Mol. Mass.:51338.40
Organism:Homo sapiens (Human)
Description:P08588
Residue:477
BDBM50287799
NameBDBM50287799
Synonyms:4-{2-[(R)-2-((S)-2-Hydroxy-3-phenoxy-propylamino)-propyl]-thiazol-5-yl}-butyric acid | CHEMBL72169
TypeSmall organic molecule
Emp. Form.C19H26N2O4S
Mol. Mass.378.486
SMILESC[C@H](Cc1ncc(CCCC(O)=O)s1)NC[C@H](O)COc1ccccc1