Reaction Details
TargetCannabinoid receptor 2
LigandBDBM50240606
Substrate/Competitorn/a
Meas. Tech.ChEBML_46993
Ki 216±n/a nM
Citation Gallant, MDufresne, CGareau, YGuay, DLeblanc, YPrasit, PRochette, CSawyer, NSlipetz, DMTremblay, NMetters, KMLabelle, M New class of potent ligands for the human peripheral cannabinoid receptor Bioorg Med Chem Lett6:2263-2268 (1996)    Article
 
Cannabinoid receptor 2
Name:Cannabinoid receptor 2
Type:G Protein-Coupled Receptor (GPCR)
Mol. Mass.:39690.94
Organism:Homo sapiens (Human)
Description:P34972
Residue:360
BDBM50240606
NameBDBM50240606
Synonyms:(2-methyl-3-(2-morpholinoethyl)-1H-indol-1-yl)(naphthalen-1-yl)methanone L-759787 | [2-Methyl-3-(2-morpholin-4-yl-ethyl)-indol-1-yl]-naphthalen-1-yl-methanone
TypeSmall organic molecule
Emp. Form.C26H26N2O2
Mol. Mass.398.4968
SMILESCc1c(CCN2CCOCC2)c2ccccc2n1C(=O)c1cccc2ccccc12