Reaction Details
TargetCannabinoid receptor 1
LigandBDBM22952
Substrate/Competitorn/a
Meas. Tech.ChEBML_46464
Ki>20000±n/a nM
Citation Gallant, MDufresne, CGareau, YGuay, DLeblanc, YPrasit, PRochette, CSawyer, NSlipetz, DMTremblay, NMetters, KMLabelle, M New class of potent ligands for the human peripheral cannabinoid receptor Bioorg Med Chem Lett6:2263-2268 (1996)    Article
 
Cannabinoid receptor 1
Name:Cannabinoid receptor 1
Type:G Protein-Coupled Receptor (GPCR)
Mol. Mass.:52868.96
Organism:Homo sapiens (Human)
Description:P21554
Residue:472
BDBM22952
NameBDBM22952
Synonyms:CHEMBL73572 methyl 2-{1-[(4-chlorophenyl)carbonyl]-5-methoxy-2-methyl-1H-indol-3-yl}acetate
TypeSmall organic molecule
Emp. Form.C20H18ClNO4
Mol. Mass.371.814
SMILESCOC(=O)Cc1c(C)n(C(=O)c2ccc(Cl)cc2)c2ccc(OC)cc12