Reaction Details
TargetCannabinoid receptor 2
LigandBDBM50287808
Substrate/Competitorn/a
Meas. Tech.ChEBML_46993
Ki 397±n/a nM
Citation Gallant, MDufresne, CGareau, YGuay, DLeblanc, YPrasit, PRochette, CSawyer, NSlipetz, DMTremblay, NMetters, KMLabelle, M New class of potent ligands for the human peripheral cannabinoid receptor Bioorg Med Chem Lett6:2263-2268 (1996)    Article
 
Cannabinoid receptor 2
Name:Cannabinoid receptor 2
Type:G Protein-Coupled Receptor (GPCR)
Mol. Mass.:39690.94
Organism:Homo sapiens (Human)
Description:P34972
Residue:360
BDBM50287808
NameBDBM50287808
Synonyms:CHEMBL307210 | [1-(2-Chloro-benzoyl)-5-methoxy-2-methyl-1H-indol-3-yl]-acetic acid methyl ester
TypeSmall organic molecule
Emp. Form.C20H18ClNO4
Mol. Mass.371.814
SMILESCOC(=O)Cc1c(C)n(C(=O)c2ccccc2Cl)c2ccc(OC)cc12