Reaction Details
TargetCannabinoid receptor 1
LigandBDBM50287810
Substrate/Competitorn/a
Meas. Tech.ChEBML_46464
Ki 6680±n/a nM
Citation Gallant, MDufresne, CGareau, YGuay, DLeblanc, YPrasit, PRochette, CSawyer, NSlipetz, DMTremblay, NMetters, KMLabelle, M New class of potent ligands for the human peripheral cannabinoid receptor Bioorg Med Chem Lett6:2263-2268 (1996)    Article
 
Cannabinoid receptor 1
Name:Cannabinoid receptor 1
Type:G Protein-Coupled Receptor (GPCR)
Mol. Mass.:52868.96
Organism:Homo sapiens (Human)
Description:P21554
Residue:472
BDBM50287810
NameBDBM50287810
Synonyms:2-Methyl-3-morpholin-4-ylmethyl-1-naphthalen-1-yl-1H-indole | CHEMBL421685
TypeSmall organic molecule
Emp. Form.C24H24N2O
Mol. Mass.356.4602
SMILESCc1c(CN2CCOCC2)c2ccccc2n1-c1cccc2ccccc12