Reaction Details
TargetDelta-type opioid receptor
LigandBDBM50287929
Substrate/Competitorn/a
Meas. Tech.ChEBML_147156
Ki 9.6±n/a nM
Citation Derrick, IMoynihan, HABroadbear, JWoods, JHLewis, JW 6N-Cinnamoyl-β-naltrexamine and its p-nitro derivative. High efficacy κ-opioid agonists with weak antagonist actions Bioorg Med Chem Lett6:167-172 (1996)    Article
 
Delta-type opioid receptor
Name:Delta-type opioid receptor
Type:G Protein-Coupled Receptor (GPCR)
Mol. Mass.:40382.98
Organism:Homo sapiens (Human)
Description:Competition binding assays were carried out using membrane preparations from transfected HN9.10 cells that constitutively expressed the delta opioid receptor.
Residue:372
BDBM50287929
NameBDBM50287929
Synonyms:1N-[4-cyclopropylmethyl-10,17-dihydroxy-(5R,13R,14R,17S)-12-oxa-4-azapentacyclo[9.6.1.01,13.05,17.07,18]octadeca-7(18),8,10-trien-14-yl]-3-(4-methylphenyl)-(E)-2-propenamide | CHEMBL297756
TypeSmall organic molecule
Emp. Form.C30H34N2O4
Mol. Mass.486.602
SMILESCc1ccc(\C=C\C(=O)N[C@@H]2CC[C@@]3(O)[C@H]4Cc5ccc(O)c6O[C@@H]2C3(CCN4CC2CC2)c56)cc1