Reaction Details
TargetCannabinoid receptor 1
LigandBDBM50287932
Substrate/Competitorn/a
Meas. Tech.ChEMBL_46463 (CHEMBL657910)
Ki>20000±n/a nM
Citation Gareau, YDufresne, CGallant, MRochette, CSawyer, NSlipetz, DMTremblay, NWeech, PKMetters, KMLabelle, M Structure activity relationships of tetrahydrocannabinol analogues on human cannabinoid receptors Bioorg Med Chem Lett6:189-194 (1996)    Article
 
Cannabinoid receptor 1
Name:Cannabinoid receptor 1
Type:G Protein-Coupled Receptor (GPCR)
Mol. Mass.:52868.96
Organism:Homo sapiens (Human)
Description:P21554
Residue:472
BDBM50287932
NameBDBM50287932
Synonyms:CHEMBL56249 | Phosphoric acid (6aR,10aR)-3-(1,1-dimethyl-heptyl)-6,6,9-trimethyl-6a,7,10,10a-tetrahydro-6H-benzo[c]chromen-1-yl ester diethyl ester
TypeSmall organic molecule
Emp. Form.C29H47O5P
Mol. Mass.506.6542
SMILESCCCCCCC(C)(C)c1cc(OP(=O)(OCC)OCC)c2[C@@H]3CC(C)=CC[C@H]3C(C)(C)Oc2c1