Reaction Details
TargetCannabinoid receptor 1
LigandBDBM50287939
Substrate/Competitorn/a
Meas. Tech.ChEBML_46461
Ki 15850±n/a nM
Citation Gareau, YDufresne, CGallant, MRochette, CSawyer, NSlipetz, DMTremblay, NWeech, PKMetters, KMLabelle, M Structure activity relationships of tetrahydrocannabinol analogues on human cannabinoid receptors Bioorg Med Chem Lett6:189-194 (1996)    Article
 
Cannabinoid receptor 1
Name:Cannabinoid receptor 1
Type:G Protein-Coupled Receptor (GPCR)
Mol. Mass.:52868.96
Organism:Homo sapiens (Human)
Description:P21554
Residue:472
BDBM50287939
NameBDBM50287939
Synonyms:(6aR,10aR)-3-(1,1-Dimethyl-heptyl)-1-methoxy-6,6,9-trimethyl-6a,7,10,10a-tetrahydro-6H-benzo[c]chromene | CHEMBL57367
TypeSmall organic molecule
Emp. Form.C26H40O2
Mol. Mass.384.5946
SMILESCCCCCCC(C)(C)c1cc(OC)c2[C@@H]3CC(C)=CC[C@H]3C(C)(C)Oc2c1