Reaction Details
TargetCannabinoid receptor 2
LigandBDBM50287938
Substrate/Competitorn/a
Meas. Tech.ChEBML_46992
Ki 132±n/a nM
Citation Gareau, YDufresne, CGallant, MRochette, CSawyer, NSlipetz, DMTremblay, NWeech, PKMetters, KMLabelle, M Structure activity relationships of tetrahydrocannabinol analogues on human cannabinoid receptors Bioorg Med Chem Lett6:189-194 (1996)    Article
 
Cannabinoid receptor 2
Name:Cannabinoid receptor 2
Type:G Protein-Coupled Receptor (GPCR)
Mol. Mass.:39690.94
Organism:Homo sapiens (Human)
Description:P34972
Residue:360
BDBM50287938
NameBDBM50287938
Synonyms:(6aR,10aR)-3-(1,1-Dimethyl-heptyl)-1-methoxy-6,6-dimethyl-6,6a,7,8,10,10a-hexahydro-benzo[c]chromen-9-one | CHEMBL56747
TypeSmall organic molecule
Emp. Form.C25H38O3
Mol. Mass.386.5674
SMILESCCCCCCC(C)(C)c1cc(OC)c2[C@@H]3CC(=O)CC[C@H]3C(C)(C)Oc2c1