Reaction Details
TargetCannabinoid receptor 2
LigandBDBM50287941
Substrate/Competitorn/a
Meas. Tech.ChEBML_46992
Ki 1.8±n/a nM
Citation Gareau, YDufresne, CGallant, MRochette, CSawyer, NSlipetz, DMTremblay, NWeech, PKMetters, KMLabelle, M Structure activity relationships of tetrahydrocannabinol analogues on human cannabinoid receptors Bioorg Med Chem Lett6:189-194 (1996)    Article
 
Cannabinoid receptor 2
Name:Cannabinoid receptor 2
Type:G Protein-Coupled Receptor (GPCR)
Mol. Mass.:39690.94
Organism:Homo sapiens (Human)
Description:P34972
Residue:360
BDBM50287941
NameBDBM50287941
Synonyms:(6aR,10aR)-1-hydroxy-6,6-dimethyl-3-(2-methyloctan-2-yl)-7,8,10,10a-tetrahydro-6H-benzo[c]chromen-9(6aH)-one CHEMBL947 Cesamet | NABILONE
TypeSmall organic molecule
Emp. Form.C24H36O3
Mol. Mass.372.5408
SMILESCCCCCCC(C)(C)c1cc(O)c2[C@@H]3CC(=O)CC[C@H]3C(C)(C)Oc2c1