Reaction Details
TargetGTPase HRas
LigandBDBM50287945
Substrate/Competitorn/a
Meas. Tech.ChEMBL_143166 (CHEMBL744343)
IC50 10000±n/a nM
Citation Wolin, RWang, DKelly, JAfonso, AJames, LKirschmeier, PMcPhail, AT Synthesis and evaluation of pyrazolo[3,4-b]quinoline ribofuranosides and their derivatives as inhibitors of oncogenic Ras Bioorg Med Chem Lett6:195-200 (1996)    Article
 
GTPase HRas
Name:GTPase HRas
Type:Other Protein Type
Mol. Mass.:21293.37
Organism:Homo sapiens (Human)
Description:P01112
Residue:189
BDBM50287945
NameBDBM50287945
Synonyms:5-(4-chloro-6-methoxy-3-methyl-1H-pyrazolo[3,4-b]quinolin-1-yl)-3,4-di(phenylcarbonyloxy)-2-phenylcarbonyloxymethyl-(2R,3R,4R,5R)-tetrahydrofuran | CHEMBL303512
TypeSmall organic molecule
Emp. Form.C38H30ClN3O8
Mol. Mass.692.113
SMILESCOc1ccc2nc3n(nc(C)c3c(Cl)c2c1)[C@@H]1O[C@H](COC(=O)c2ccccc2)[C@@H](OC(=O)c2ccccc2)[C@H]1OC(=O)c1ccccc1