Reaction Details
TargetGTPase HRas
LigandBDBM50287951
Substrate/Competitorn/a
Meas. Tech.ChEBML_143166
IC50 1500±n/a nM
Citation Wolin, RWang, DKelly, JAfonso, AJames, LKirschmeier, PMcPhail, AT Synthesis and evaluation of pyrazolo[3,4-b]quinoline ribofuranosides and their derivatives as inhibitors of oncogenic Ras Bioorg Med Chem Lett6:195-200 (1996)    Article
 
GTPase HRas
Name:GTPase HRas
Type:Other Protein Type
Mol. Mass.:21293.37
Organism:Homo sapiens (Human)
Description:P01112
Residue:189
BDBM50287951
NameBDBM50287951
Synonyms:3-[(3aS,4R,6R,6aR)-6-(4-Chloro-6-methoxy-3-methyl-pyrazolo[3,4-b]quinolin-1-yl)-2-thioxo-tetrahydro-furo[3,4-d][1,3]dioxol-4-yloxy]-3-hydroxy-1-phenyl-propan-1-one | CHEMBL304862
TypeSmall organic molecule
Emp. Form.C26H22ClN3O7S
Mol. Mass.555.987
SMILESCOc1ccc2nc3n(nc(C)c3c(Cl)c2c1)[C@@H]1O[C@H](OC(O)CC(=O)c2ccccc2)[C@H]2OC(=S)O[C@@H]12