Reaction Details
TargetGTPase HRas
LigandBDBM50287954
Substrate/Competitorn/a
Meas. Tech.ChEBML_143166
IC50 35000±n/a nM
Citation Wolin, RWang, DKelly, JAfonso, AJames, LKirschmeier, PMcPhail, AT Synthesis and evaluation of pyrazolo[3,4-b]quinoline ribofuranosides and their derivatives as inhibitors of oncogenic Ras Bioorg Med Chem Lett6:195-200 (1996)    Article
 
GTPase HRas
Name:GTPase HRas
Type:Other Protein Type
Mol. Mass.:21293.37
Organism:Homo sapiens (Human)
Description:P01112
Residue:189
BDBM50287954
NameBDBM50287954
Synonyms:(E)-3-[(2S,5R)-5-(4-Chloro-6-methoxy-3-methyl-pyrazolo[3,4-b]quinolin-1-yl)-2,5-dihydro-furan-2-yloxy]-1-phenyl-propenone | CHEMBL176954
TypeSmall organic molecule
Emp. Form.C25H20ClN3O4
Mol. Mass.461.897
SMILESCOc1ccc2nc3n(nc(C)c3c(Cl)c2c1)[C@@H]1O[C@H](O\C=C\C(=O)c2ccccc2)C=C1