Reaction Details
TargetRetinoic acid receptor alpha
LigandBDBM50101444
Substrate/Competitorn/a
Meas. Tech.ChEMBL_195326 (CHEMBL799721)
Kd 556±n/a nM
Citation Vuligonda, VLin, YChandraratna, RA Synthesis of highly potent RXR-specific retinoids: The use of a cyclopropyl group as a double bond isostere Bioorg Med Chem Lett6:213-218 (1996)    Article
 
Retinoic acid receptor alpha
Name:Retinoic acid receptor alpha
Type:PROTEIN
Mol. Mass.:50778.87
Organism:Homo sapiens (Human)
Description:ChEMBL_1466191
Residue:462
BDBM50101444
NameBDBM50101444
Synonyms:(E)-3-Methyl-5-[2-methyl-2-(5,5,8,8-tetramethyl-5,6,7,8-tetrahydro-naphthalen-2-yl)-cyclopropyl]-penta-2,4-dienoic acid CHEMBL69091
TypeSmall organic molecule
Emp. Form.C24H32O2
Mol. Mass.352.5097
SMILESC\C(\C=C\C1CC1(C)c1ccc2c(c1)C(C)(C)CCC2(C)C)=C/C(O)=O