Reaction Details
TargetReverse transcriptase/RNaseH
LigandBDBM50288055
Substrate/Competitorn/a
Meas. Tech.ChEBML_195046
IC50>100000±n/a nM
Citation Weaver, RGilbert, IHMahmood, NBalzarini, J Isosteres of nucleoside triphosphates Bioorg Med Chem Lett6:2405-2410 (1996)    Article
 
Reverse transcriptase/RNaseH
Name:Reverse transcriptase/RNaseH
Type:PROTEIN
Mol. Mass.:65229.15
Organism:Human immunodeficiency virus 1
Description:ChEMBL_1473730
Residue:566
BDBM50288055
NameBDBM50288055
Synonyms:(4-Allyloxycarbonylmethyl-5-oxo-[1,3]dioxolan-4-yl)-acetic acid 5-(5-methyl-2,4-dioxo-3,4-dihydro-2H-pyrimidin-1-yl)-2,5-dihydro-furan-2-ylmethyl ester | CHEMBL79656
TypeSmall organic molecule
Emp. Form.C20H22N2O10
Mol. Mass.450.3961
SMILESCc1cn(C2OC(COC(=O)CC3(CC(=O)OCC=C)OCOC3=O)C=C2)c(=O)[nH]c1=O