Reaction Details
TargetNeprilysin
LigandBDBM50024102
Substrate/Competitorn/a
Meas. Tech.ChEBML_144431
Ki 2.2±n/a nM
Citation Danvy, DMonteil, TPlaquevent, JCDuhamel, LDuhamel, PGros, CNoël, NSchwartz, JCLecomte, JM Studies on the structural feature of S'1 subsite of neprilysin (EC.3.4.24.11): Stereochemical requirement for the enzyme-inhibitor docking process Bioorg Med Chem Lett6:2437-2440 (1996)    Article
 
Neprilysin
Name:Neprilysin
Type:Enzyme
Mol. Mass.:85505.38
Organism:Homo sapiens (Human)
Description:P08473
Residue:750
BDBM50024102
NameBDBM50024102
Synonyms:((S)-2-Mercaptomethyl-3-phenyl-propionylamino)-acetic acid (S) (2-Mercaptomethyl-3-phenyl-propionylamino)-acetic acid CHEMBL298827
TypeSmall organic molecule
Emp. Form.C12H15NO3S
Mol. Mass.253.317
SMILESOC(=O)CNC(=O)[C@@H](CS)Cc1ccccc1