Reaction Details
TargetIntegrin alpha-IIb/beta-3
LigandBDBM50288117
Substrate/Competitorn/a
Meas. Tech.ChEMBL_218205 (CHEMBL824554)
Ki 1.7±n/a nM
Citation Miller, WHAli, FEBondinell, WECallahan, JFCalvo, RREggleston, DSHaltiwanger, RCHuffman, WFHwang, SMJakas, DRKeenan, RMKoster, PFKu, TWKwon, CNewlander, KANichols, AJParker, MFSamanen, JMSouthall, LSTakata, DT Structure-activity relationships in 3-oxo-1,4-benzodiazepine-2-acetic acid GPIIb/IIIa antagonists. The 2-benzazepine series Bioorg Med Chem Lett6:2481-2486 (1996)    Article
 
Integrin alpha-IIb/beta-3
Name:Integrin alpha-IIb/beta-3
Synonyms:Glycoprotein IIb/IIIa
Type:n/a
Mol. Mass.:n/a
Description:ASSAY_ID of EBI is 30109
Components:This complex has 2 components.
Component 1
Name:Integrin beta-3
Type:Protein
Mol. Mass.:87038.91
Organism:Homo sapiens (Human)
Description:P05106
Residue:788
Component 2
Name:Integrin alpha-IIb
Synonyms:CD_antigen=CD41 GPIIb Glycoprotein IIb ITGA2B Integrin alpha-IIb heavy chain Integrin alpha-IIb light chain, form 2 Integrin alpha-V/beta-3 and alpha-IIb/beta 3 | Platelet membrane glycoprotein IIb
Type:Protein
Mol. Mass.:113354.85
Organism:Homo sapiens (Human)
Description:P08514
Residue:1039
BDBM50288117
NameBDBM50288117
Synonyms:CHEMBL83756 | {2-[2-(4-Fluoro-phenyl)-ethyl]-7-[methyl-(2-piperidin-4-yl-ethyl)-carbamoyl]-3-oxo-2,3,4,5-tetrahydro-1H-benzo[c]azepin-4-yl}-acetic acid
TypeSmall organic molecule
Emp. Form.C29H36FN3O4
Mol. Mass.509.6122
SMILESCN(CCC1CCNCC1)C(=O)c1ccc2CN(CCc3ccc(F)cc3)C(=O)C(CC(O)=O)Cc2c1