Reaction Details
TargetProstaglandin G/H synthase 2
LigandBDBM50288294
Substrate/Competitorn/a
Meas. Tech.ChEBML_159735
IC50 12±n/a nM
Citation Friesen, RWDubé, DFortin, RFrenette, RPrescott, SCromlish, WGreig, GMKargman, SWong, EChan, CCGordon, RXu, LJRiendeau, D Novel 1,2-diarylcyclobutenes: Selective and orally active cox-2 inhibitors Bioorg Med Chem Lett6:2677-2682 (1996)    Article
 
Prostaglandin G/H synthase 2
Name:Prostaglandin G/H synthase 2
Type:Enzyme
Mol. Mass.:69003.89
Organism:Homo sapiens (Human)
Description:Recombinant Cox-2 provided by Cayman (Cayman Chemical Co.,Ann Arbor, MI).
Residue:604
BDBM50288294
NameBDBM50288294
Synonyms:3-(4-Methanesulfonyl-phenyl)-2-phenyl-spiro[3.4]oct-2-en-1-one | CHEMBL90988
TypeSmall organic molecule
Emp. Form.C21H20O3S
Mol. Mass.352.447
SMILESCS(=O)(=O)c1ccc(cc1)C1=C(C(=O)C11CCCC1)c1ccccc1