Reaction Details
TargetDipeptidyl peptidase 4
LigandBDBM50288308
Substrate/Competitorn/a
Meas. Tech.ChEBML_53349
Ki 0.500000±n/a nM
Citation Ashworth, DMAtrash, BBaker, GRBaxter, AJJenkins, PDJones, DMSzelke, M 4-cyanothiazolidides as very potent, stable inhibitors of dipeptidyl peptidase IV Bioorg Med Chem Lett6:2745-2748 (1996)    Article
 
Dipeptidyl peptidase 4
Name:Dipeptidyl peptidase 4
Type:Enzyme
Mol. Mass.:88271.01
Organism:Homo sapiens (Human)
Description:P27487
Residue:766
BDBM50288308
NameBDBM50288308
Synonyms:(R)-3-(2-Amino-2-cyclopentyl-acetyl)-thiazolidine-4-carbonitrile | CHEMBL93060
TypeSmall organic molecule
Emp. Form.C11H17N3OS
Mol. Mass.239.337
SMILESNC(C1CCCC1)C(=O)N1CSC[C@H]1C#N