Reaction Details
TargetProthrombin
LigandBDBM50288400
Substrate/Competitorn/a
Meas. Tech.ChEBML_225479
Ki 600±n/a nM
Citation Galemmo, RAFevig, JMCarini, DJCacciola, JWells, BLHillyer, GLJr., JBRossi, KAStouten, PFAlexander, RSHilmer, RBostrom, LAbelman, MMLee, SLWeber, PCKettner, CAKnabb, RMWexler, RR (N-acyl-N-alkyl)glycyl borolysine analogs: A new class of potent thrombin inhibitors Bioorg Med Chem Lett6:2913-2918 (1996)    Article
 
Prothrombin
Name:Prothrombin
Type:Enzyme
Mol. Mass.:70502.73
Organism:Bos taurus (Bovine)
Description:P00735
Residue:625
BDBM50288400
NameBDBM50288400
Synonyms:CHEMBL419892 | N-[(5-Amino-1-dihydroxyboranyl-pentylcarbamoyl)-methyl]-N-cyclohexyl-3-phenyl-propionamide
TypeSmall organic molecule
Emp. Form.C22H36BN3O4
Mol. Mass.417.35
SMILESNCCCC[C@H](NC(=O)CN(C1CCCCC1)C(=O)CCc1ccccc1)B(O)O