Reaction Details
TargetTissue-type plasminogen activator
LigandBDBM50288413
Substrate/Competitorn/a
Meas. Tech.ChEBML_225390
Ki 280±n/a nM
Citation Galemmo, RAFevig, JMCarini, DJCacciola, JWells, BLHillyer, GLJr., JBRossi, KAStouten, PFAlexander, RSHilmer, RBostrom, LAbelman, MMLee, SLWeber, PCKettner, CAKnabb, RMWexler, RR (N-acyl-N-alkyl)glycyl borolysine analogs: A new class of potent thrombin inhibitors Bioorg Med Chem Lett6:2913-2918 (1996)    Article
 
Tissue-type plasminogen activator
Name:Tissue-type plasminogen activator
Type:Enzyme
Mol. Mass.:62931.08
Organism:Homo sapiens (Human)
Description:n/a
Residue:562
BDBM50288413
NameBDBM50288413
Synonyms:CHEMBL101759 | N-[(5-Amino-1-dihydroxyboranyl-pentylcarbamoyl)-methyl]-3,N-diphenyl-propionamide
TypeSmall organic molecule
Emp. Form.C22H30BN3O4
Mol. Mass.411.302
SMILESNCCCC[C@H](NC(=O)CN(C(=O)CCc1ccccc1)c1ccccc1)B(O)O