Reaction Details
TargetProthrombin
LigandBDBM50288412
Substrate/Competitorn/a
Meas. Tech.ChEBML_225479
Ki 350±n/a nM
Citation Galemmo, RAFevig, JMCarini, DJCacciola, JWells, BLHillyer, GLJr., JBRossi, KAStouten, PFAlexander, RSHilmer, RBostrom, LAbelman, MMLee, SLWeber, PCKettner, CAKnabb, RMWexler, RR (N-acyl-N-alkyl)glycyl borolysine analogs: A new class of potent thrombin inhibitors Bioorg Med Chem Lett6:2913-2918 (1996)    Article
 
Prothrombin
Name:Prothrombin
Type:Enzyme
Mol. Mass.:70502.73
Organism:Bos taurus (Bovine)
Description:P00735
Residue:625
BDBM50288412
NameBDBM50288412
Synonyms:CHEMBL330149 | N-[(5-Amino-1-dihydroxyboranyl-pentylcarbamoyl)-methyl]-N-methyl-4-phenyl-butyramide
TypeSmall organic molecule
Emp. Form.C18H30BN3O4
Mol. Mass.363.26
SMILESCN(CC(=O)N[C@@H](CCCCN)B(O)O)C(=O)CCCc1ccccc1