Reaction Details
TargetProthrombin
LigandBDBM50288407
Substrate/Competitorn/a
Meas. Tech.ChEBML_208357
Ki 0.690000±n/a nM
Citation Galemmo, RAFevig, JMCarini, DJCacciola, JWells, BLHillyer, GLJr., JBRossi, KAStouten, PFAlexander, RSHilmer, RBostrom, LAbelman, MMLee, SLWeber, PCKettner, CAKnabb, RMWexler, RR (N-acyl-N-alkyl)glycyl borolysine analogs: A new class of potent thrombin inhibitors Bioorg Med Chem Lett6:2913-2918 (1996)    Article
 
Prothrombin
Name:Prothrombin
Type:Protein
Mol. Mass.:70029.57
Organism:Homo sapiens (Human)
Description:P00734
Residue:622
BDBM50288407
NameBDBM50288407
Synonyms:CHEMBL317137 | N-[(5-Amino-1-dihydroxyboranyl-pentylcarbamoyl)-methyl]-N-cyclopropyl-3-phenyl-propionamide
TypeSmall organic molecule
Emp. Form.C19H30BN3O4
Mol. Mass.375.27
SMILESNCCCC[C@H](NC(=O)CN(C1CC1)C(=O)CCc1ccccc1)B(O)O