Reaction Details
TargetProthrombin
LigandBDBM50288414
Substrate/Competitorn/a
Meas. Tech.ChEBML_225479
Ki 200±n/a nM
Citation Galemmo, RAFevig, JMCarini, DJCacciola, JWells, BLHillyer, GLJr., JBRossi, KAStouten, PFAlexander, RSHilmer, RBostrom, LAbelman, MMLee, SLWeber, PCKettner, CAKnabb, RMWexler, RR (N-acyl-N-alkyl)glycyl borolysine analogs: A new class of potent thrombin inhibitors Bioorg Med Chem Lett6:2913-2918 (1996)    Article
 
Prothrombin
Name:Prothrombin
Type:Enzyme
Mol. Mass.:70502.73
Organism:Bos taurus (Bovine)
Description:P00735
Residue:625
BDBM50288414
NameBDBM50288414
Synonyms:1-(2-Acetylamino-3-phenyl-propionyl)-pyrrolidine-2-carboxylic acid (5-amino-1-dihydroxyboranyl-pentyl)-amide CHEMBL100109
TypeSmall organic molecule
Emp. Form.C21H33BN4O5
Mol. Mass.432.322
SMILESCC(=O)N[C@H](Cc1ccccc1)C(=O)N1CCC[C@H]1C(=O)N[C@@H](CCCCN)B(O)O