Reaction Details
TargetTissue-type plasminogen activator
LigandBDBM50288406
Substrate/Competitorn/a
Meas. Tech.ChEBML_225390
Ki 5.7±n/a nM
Citation Galemmo, RAFevig, JMCarini, DJCacciola, JWells, BLHillyer, GLJr., JBRossi, KAStouten, PFAlexander, RSHilmer, RBostrom, LAbelman, MMLee, SLWeber, PCKettner, CAKnabb, RMWexler, RR (N-acyl-N-alkyl)glycyl borolysine analogs: A new class of potent thrombin inhibitors Bioorg Med Chem Lett6:2913-2918 (1996)    Article
 
Tissue-type plasminogen activator
Name:Tissue-type plasminogen activator
Type:Enzyme
Mol. Mass.:62931.08
Organism:Homo sapiens (Human)
Description:n/a
Residue:562
BDBM50288406
NameBDBM50288406
Synonyms:1-(2-Acetylamino-3-phenyl-propionyl)-pyrrolidine-2-carboxylic acid (1-dihydroxyboranyl-4-guanidino-butyl)-amide CHEMBL290376
TypeSmall organic molecule
Emp. Form.C21H33BN6O5
Mol. Mass.460.335
SMILESCC(=O)N[C@H](Cc1ccccc1)C(=O)N1CCC[C@H]1C(=O)N[C@@H](CCCNC(N)=N)B(O)O