Reaction Details
TargetProthrombin
LigandBDBM50288402
Substrate/Competitorn/a
Meas. Tech.ChEBML_208357
Ki 2.1±n/a nM
Citation Galemmo, RAFevig, JMCarini, DJCacciola, JWells, BLHillyer, GLJr., JBRossi, KAStouten, PFAlexander, RSHilmer, RBostrom, LAbelman, MMLee, SLWeber, PCKettner, CAKnabb, RMWexler, RR (N-acyl-N-alkyl)glycyl borolysine analogs: A new class of potent thrombin inhibitors Bioorg Med Chem Lett6:2913-2918 (1996)    Article
 
Prothrombin
Name:Prothrombin
Type:Protein
Mol. Mass.:70029.57
Organism:Homo sapiens (Human)
Description:P00734
Residue:622
BDBM50288402
NameBDBM50288402
Synonyms:Borolysine analogue | CHEMBL431814
TypeSmall organic molecule
Emp. Form.C18H30BN5O4
Mol. Mass.391.273
SMILESCN=C(N)NCCC[C@H](NC(=O)CN(C)C(=O)CCc1ccccc1)B(O)O