Reaction Details
TargetGag-Pol polyprotein [489-587]
LigandBDBM50288424
Substrate/Competitorn/a
Meas. Tech.ChEBML_157739
Ki 0.090000±n/a nM
Citation Rodgers, JDJohnson, BLWang, HGreenberg, RAErickson-Viitanen, SKlabe, RMCordova, BCRayner, MMLam, GNChang, CH Potent cyclic urea HIV protease inhibitors with benzofused heterocycles as P2/P2′ groups Bioorg Med Chem Lett6:2919-2924 (1996)    Article
 
Gag-Pol polyprotein [489-587]
Name:Gag-Pol polyprotein [489-587]
Type:Enzyme Subunit
Mol. Mass.:10781.16
Organism:Human immunodeficiency virus type 1
Description:P04585[489-587]
Residue:99
BDBM50288424
NameBDBM50288424
Synonyms:(4R,5S,6S,7R)-1,3-Bis-(1H-benzotriazol-5-ylmethyl)-4,7-dibenzyl-5,6-dihydroxy-[1,3]diazepan-2-one | CHEMBL99174
TypeSmall organic molecule
Emp. Form.C33H32N8O3
Mol. Mass.588.659
SMILESO[C@@H]1[C@@H](O)[C@@H](Cc2ccccc2)N(Cc2ccc3nn[nH]c3c2)C(=O)N(Cc2ccc3nn[nH]c3c2)[C@@H]1Cc1ccccc1