Reaction Details
TargetChymotrypsin-like elastase family member 2A
LigandBDBM50282873
Substrate/Competitorn/a
Meas. Tech.ChEBML_158078
Ki>10000±n/a nM
Citation Hlasta, DJCourt, JJDesai, RCTalomie, TGShen, JDunlap, RPand, CAMura, AJ A comparative SAR and computer modeling study of benzisothiazolone, mechanism-based inhibitors with porcine pancreatic and human leukocyte elastase Bioorg Med Chem Lett6:2941-2946 (1996)    Article
 
Chymotrypsin-like elastase family member 2A
Name:Chymotrypsin-like elastase family member 2A
Type:PROTEIN
Mol. Mass.:28705.23
Organism:Sus scrofa
Description:ChEMBL_156951
Residue:269
BDBM50282873
NameBDBM50282873
Synonyms:4-sec-Butyl-1,1-dioxo-2-(1-phenyl-1H-tetrazol-5-ylsulfanylmethyl)-1,2-dihydro-1lambda*6*-benzo[d]isothiazol-3-one | CHEMBL50830
TypeSmall organic molecule
Emp. Form.C19H19N5O3S2
Mol. Mass.429.516
SMILESCCC(C)c1cccc2c1C(=O)N(CSc1nnnn1-c1ccccc1)S2(=O)=O