Reaction Details
TargetChymotrypsin-like protease CTRL-1
LigandBDBM50031440
Substrate/Competitorn/a
Meas. Tech.ChEBML_49606
IC50 6±n/a nM
Citation Iqbal, MChatterjee, SKauer, JCMallamo, JPMessina, PAReiboldt, ASiman, R Potent α-ketocarbonyl and boronic ester derived inhibitors of proteasome Bioorg Med Chem Lett6:287-290 (1996)    Article
 
Chymotrypsin-like protease CTRL-1
Name:Chymotrypsin-like protease CTRL-1
Type:PROTEIN
Mol. Mass.:28008.18
Organism:Homo sapiens (Human)
Description:ChEMBL_49606
Residue:264
BDBM50031440
NameBDBM50031440
Synonyms:1N-[4-amino(nitroimino)methylamino-1-(1-formyl-3-methylbutylcarbamoyl)butyl]-10-cyano-2-cyclopentyldecanamide CHEMBL74336
TypeSmall organic molecule
Emp. Form.C28H49N7O5
Mol. Mass.563.7326
SMILESCC(C)CC(NC(=O)C(CCCN=C(N)N[N+]([O-])=O)NC(=O)C(CCCCCCCCC#N)C1CCCC1)C=O