Reaction Details
TargetProthrombin
LigandBDBM50288636
Substrate/Competitorn/a
Meas. Tech.ChEBML_208891
Ki 0.290000±n/a nM
Citation Cacciola, JFevig, JMAlexander, RSBrittelli, DRKettner, CAKnabb, RMWeber, PC Synthesis of conformationally-restricted boropeptide thrombin inhibitors Bioorg Med Chem Lett6:301-306 (1996)    Article
 
Prothrombin
Name:Prothrombin
Type:Protein
Mol. Mass.:70029.57
Organism:Homo sapiens (Human)
Description:P00734
Residue:622
BDBM50288636
NameBDBM50288636
Synonyms:(S)-1-(2-Benzyl-benzoyl)-pyrrolidine-2-carboxylic acid [(R)-5-amino-1-((1S,2S,6R,8S)-2,9,9-trimethyl-3,5-dioxa-4-bora-tricyclo[6.1.1.0*2,6*]dec-4-yl)-pentyl]-amide; hydrochloride | CHEMBL2448356
TypeSmall organic molecule
Emp. Form.C34H47BClN3O4
Mol. Mass.608.019
SMILESCl.[H][C@@]12C[C@@]([H])(C1(C)C)[C@]1(C)OB(O[C@]1([H])C2)[C@H](CCCCN)NC(=O)[C@@H]1CCCN1C(=O)c1ccccc1Cc1ccccc1