Reaction Details
TargetStromelysin-1
LigandBDBM50288677
Substrate/Competitorn/a
Meas. Tech.ChEBML_102081
Ki 4.5±n/a nM
Citation Caldwell, CGSahoo, SPPolo, SAEversole, RRLanza, TJMills, SGNiedzwiecki, LMIzquierdo-Martin, MChang, BCHarrison, RKKuo, DWLin, TYStein, RLDurette, PLHagmann, WK Phosphinic acid inhibitors of matrix metalloproteinases Bioorg Med Chem Lett6:323-328 (1996)    Article
 
Stromelysin-1
Name:Stromelysin-1
Type:Enzyme
Mol. Mass.:53973.13
Organism:Homo sapiens (Human)
Description: P08254
Residue:477
BDBM50288677
NameBDBM50288677
Synonyms:CHEMBL324691 | [(E)-4-(1,3-Dioxo-1,3-dihydro-isoindol-2-yl)-but-2-enyl]-[(S)-2-((S)-3-methyl-1-phenylcarbamoyl-butylcarbamoyl)-4-phenyl-butyl]-phosphinic acid
TypeSmall organic molecule
Emp. Form.C35H40N3O6P
Mol. Mass.629.6824
SMILESCC(C)C[C@H](NC(=O)C(CCc1ccccc1)=CP(O)(=O)CCCCN1C(=O)c2ccccc2C1=O)C(=O)Nc1ccccc1