Reaction Details
TargetStromelysin-1
LigandBDBM50288682
Substrate/Competitorn/a
Meas. Tech.ChEBML_102081
Ki 24±n/a nM
Citation Caldwell, CGSahoo, SPPolo, SAEversole, RRLanza, TJMills, SGNiedzwiecki, LMIzquierdo-Martin, MChang, BCHarrison, RKKuo, DWLin, TYStein, RLDurette, PLHagmann, WK Phosphinic acid inhibitors of matrix metalloproteinases Bioorg Med Chem Lett6:323-328 (1996)    Article
 
Stromelysin-1
Name:Stromelysin-1
Type:Enzyme
Mol. Mass.:53973.13
Organism:Homo sapiens (Human)
Description: P08254
Residue:477
BDBM50288682
NameBDBM50288682
Synonyms:CHEMBL110991 | {4-[((R)-1-Benzoyl-pyrrolidine-2-carbonyl)-amino]-butyl}-[(S)-2-((S)-3-methyl-1-phenylcarbamoyl-butylcarbamoyl)-4-phenyl-butyl]-phosphinic acid
TypeSmall organic molecule
Emp. Form.C39H51N4O6P
Mol. Mass.702.8192
SMILESCC(C)C[C@H](NC(=O)[C@H](CCc1ccccc1)CP(O)(=O)CCCCNC(=O)[C@H]1CCCN1C(=O)c1ccccc1)C(=O)Nc1ccccc1