Reaction Details
Target72 kDa type IV collagenase
LigandBDBM50288687
Substrate/Competitorn/a
Meas. Tech.ChEBML_101916
Ki 6.1±n/a nM
Citation Caldwell, CGSahoo, SPPolo, SAEversole, RRLanza, TJMills, SGNiedzwiecki, LMIzquierdo-Martin, MChang, BCHarrison, RKKuo, DWLin, TYStein, RLDurette, PLHagmann, WK Phosphinic acid inhibitors of matrix metalloproteinases Bioorg Med Chem Lett6:323-328 (1996)    Article
 
72 kDa type IV collagenase
Name:72 kDa type IV collagenase
Type:Enzyme
Mol. Mass.:73870.36
Organism:Homo sapiens (Human)
Description: P08253
Residue:660
BDBM50288687
NameBDBM50288687
Synonyms:CHEMBL111975 | {4-[((S)-1-Acetyl-pyrrolidine-2-carbonyl)-amino]-butyl}-[(S)-2-((S)-3-methyl-1-phenylcarbamoyl-butylcarbamoyl)-4-phenyl-butyl]-phosphinic acid
TypeSmall organic molecule
Emp. Form.C34H49N4O6P
Mol. Mass.640.7498
SMILESCC(C)C[C@H](NC(=O)[C@H](CCc1ccccc1)CP(O)(=O)CCCCNC(=O)[C@@H]1CCCN1C(C)=O)C(=O)Nc1ccccc1