Reaction Details
TargetStromelysin-1
LigandBDBM50288690
Substrate/Competitorn/a
Meas. Tech.ChEBML_102081
Ki 130±n/a nM
Citation Caldwell, CGSahoo, SPPolo, SAEversole, RRLanza, TJMills, SGNiedzwiecki, LMIzquierdo-Martin, MChang, BCHarrison, RKKuo, DWLin, TYStein, RLDurette, PLHagmann, WK Phosphinic acid inhibitors of matrix metalloproteinases Bioorg Med Chem Lett6:323-328 (1996)    Article
 
Stromelysin-1
Name:Stromelysin-1
Type:Enzyme
Mol. Mass.:53973.13
Organism:Homo sapiens (Human)
Description: P08254
Residue:477
BDBM50288690
NameBDBM50288690
Synonyms:CHEMBL109670 | [(S)-2-((S)-3-Methyl-1-phenylcarbamoyl-butylcarbamoyl)-4-phenyl-butyl]-[4-(3-methyl-ureido)-butyl]-phosphinic acid
TypeSmall organic molecule
Emp. Form.C29H43N4O5P
Mol. Mass.558.6493
SMILESCNC(=O)NCCCCP(O)(=O)C[C@@H](CCc1ccccc1)C(=O)N[C@@H](CC(C)C)C(=O)Nc1ccccc1