Reaction Details
TargetStromelysin-1
LigandBDBM50288691
Substrate/Competitorn/a
Meas. Tech.ChEBML_102081
Ki 440±n/a nM
Citation Caldwell, CGSahoo, SPPolo, SAEversole, RRLanza, TJMills, SGNiedzwiecki, LMIzquierdo-Martin, MChang, BCHarrison, RKKuo, DWLin, TYStein, RLDurette, PLHagmann, WK Phosphinic acid inhibitors of matrix metalloproteinases Bioorg Med Chem Lett6:323-328 (1996)    Article
 
Stromelysin-1
Name:Stromelysin-1
Type:Enzyme
Mol. Mass.:53973.13
Organism:Homo sapiens (Human)
Description: P08254
Residue:477
BDBM50288691
NameBDBM50288691
Synonyms:CHEMBL111601 | [4-(1,3-Dioxo-1,3-dihydro-isoindol-2-yl)-butyl]-[(S)-4-(2-methoxy-phenyl)-2-((S)-3-methyl-1-phenylcarbamoyl-butylcarbamoyl)-butyl]-phosphinic acid
TypeSmall organic molecule
Emp. Form.C36H44N3O7P
Mol. Mass.661.7242
SMILESCOc1ccccc1CC[C@H](CP(O)(=O)CCCCN1C(=O)c2ccccc2C1=O)C(=O)N[C@@H](CC(C)C)C(=O)Nc1ccccc1